BDBM50122356 CHEMBL3622432
SMILES FC(F)(F)c1nnc2CCc3cc(ccc3-n12)-c1cccnc1
InChI Key InChIKey=IJXJGCXGENZIFO-UHFFFAOYSA-N
Data  2 IC50
  Tab Delimited (TSV)   2D SDfile   Computed 3D by Vconf -m prep SDfile
Find this compound or compounds like it in BindingDB:
Activity Spreadsheet -- Enzyme Inhibition Constant Data from BindingDB
Found 2 hits for monomerid = 50122356
TargetCytochrome P450 11B1, mitochondrial(Homo sapiens (Human))
Merck Research Laboratories
Curated by ChEMBL
LigandPNGBDBM50122356(CHEMBL3622432)
Affinity DataIC50: >8.33E+3nM. Assay description: Inhibition of human CYP11B1 expressed in V79 cells assessed as cortisol level after 3 hrs by HTRF assay in presence of 250 nM 11-deoxycortisol
In DepthDetails ArticlePubMed
TargetCytochrome P450 11B2, mitochondrial(Homo sapiens (Human))
Merck Research Laboratories
Curated by ChEMBL
LigandPNGBDBM50122356(CHEMBL3622432)
Affinity DataIC50:  506nM. Assay description: Inhibition of human CYP11B2 expressed in V79 cells assessed as aldosterone level after 3 hrs by HTRF assay in presence of 125 nM 11-deoxycorticostero...
In DepthDetails ArticlePubMed