BDBM50122700 4'-Oxazol-2-yl-2'-(3-trifluoromethyl-pyrazol-1-ylmethyl)-biphenyl-2-sulfonic acid (3,4-dimethyl-isoxazol-5-yl)-amide::CHEMBL285832
SMILES Cc1noc(NS(=O)(=O)c2ccccc2-c2ccc(cc2Cn2ccc(n2)C(F)(F)F)-c2ncco2)c1C
InChI Key InChIKey=XUNPAGDDNXAXMC-UHFFFAOYSA-N
Data  2 KI
  Tab Delimited (TSV)   2D SDfile   Computed 3D by Vconf -m prep SDfile
Find this compound or compounds like it in BindingDB:
Activity Spreadsheet -- Enzyme Inhibition Constant Data from BindingDB
Found 2 hits for monomerid = 50122700
TargetEndothelin-1 receptor(Homo sapiens (Human))
Bristol-Myers Squibb Pharmaceutical Research Institute
Curated by ChEMBL
LigandPNGBDBM50122700(4'-Oxazol-2-yl-2'-(3-trifluoromethyl-pyrazol-1-ylm...)
Affinity DataKi:  0.0200nM. Assay description: Inhibitory activity against human endothelin A receptor expressed in CHO cells
In DepthDetails ArticlePubMed
TargetEndothelin receptor type B(Homo sapiens (Human))
Bristol-Myers Squibb Pharmaceutical Research Institute
Curated by ChEMBL
LigandPNGBDBM50122700(4'-Oxazol-2-yl-2'-(3-trifluoromethyl-pyrazol-1-ylm...)
Affinity DataKi:  1.50E+3nM. Assay description: Inhibitory activity against human endothelin B receptor expressed in CHO cells
In DepthDetails ArticlePubMed