BDBM50122772 1-(3-Dimethylaminomethyl-phenyl)-8,9-dihydro-7H-2,7,9a-triaza-benzo[cd]azulen-6-one::CHEMBL417036
SMILES CN(C)Cc1cccc(c1)-c1nc2cccc3C(=O)NCCn1c23
InChI Key InChIKey=ODYWEDXOLLNDIN-UHFFFAOYSA-N
Data  1 KI
  Tab Delimited (TSV)   2D SDfile   Computed 3D by Vconf -m prep SDfile
Find this compound or compounds like it in BindingDB:
Activity Spreadsheet -- Enzyme Inhibition Constant Data from BindingDB
Found 1 hit for monomerid = 50122772
TargetPoly [ADP-ribose] polymerase 1(Homo sapiens (Human))
Pfizer
Curated by ChEMBL
LigandPNGBDBM50122772(1-(3-Dimethylaminomethyl-phenyl)-8,9-dihydro-7H-2,...)
Affinity DataKi:  6.30nM. Assay description: Inhibitory activity of the compound against human full length Poly (ADP-ribose) polymerase 1
In DepthDetails ArticlePubMed