BDBM50122779 1-(4-Chloro-phenyl)-8,9-dihydro-7H-2,7,9a-triaza-benzo[cd]azulen-6-one::CHEMBL69407
SMILES Clc1ccc(cc1)-c1nc2cccc3C(=O)NCCn1c23
InChI Key InChIKey=GJIMQPBRSOGRME-UHFFFAOYSA-N
Data  1 KI
  Tab Delimited (TSV)   2D SDfile   Computed 3D by Vconf -m prep SDfile
Find this compound or compounds like it in BindingDB:
Activity Spreadsheet -- Enzyme Inhibition Constant Data from BindingDB
Found 1 hit for monomerid = 50122779
TargetPoly [ADP-ribose] polymerase 1(Homo sapiens (Human))
Pfizer
Curated by ChEMBL
LigandPNGBDBM50122779(1-(4-Chloro-phenyl)-8,9-dihydro-7H-2,7,9a-triaza-b...)
Affinity DataKi:  5.70nM. Assay description: Inhibitory activity of the compound against human full length Poly (ADP-ribose) polymerase 1
In DepthDetails ArticlePubMed