BDBM50122990 CHEMBL342159::N-{4-[5-(3-Benzo[1,3]dioxol-5-yl-9-oxo-1,3,4,9-tetrahydro-pyrrolo[3,4-b]quinoline-2-carbonyl)-furan-2-yl]-phenyl}-methanesulfonamide
SMILES CS(=O)(=O)Nc1ccc(cc1)-c1ccc(o1)C(=O)N1Cc2c(nc3ccccc3c2O)C1c1ccc2OCOc2c1
InChI Key InChIKey=PHHZIJWFNAUADE-UHFFFAOYSA-N
Data  1 KI
  Tab Delimited (TSV)   2D SDfile   Computed 3D by Vconf -m prep SDfile
Find this compound or compounds like it in BindingDB:
Activity Spreadsheet -- Enzyme Inhibition Constant Data from BindingDB
Found 1 hit for monomerid = 50122990
TargetcGMP-specific 3',5'-cyclic phosphodiesterase(Homo sapiens (Human))
Johnson & Johnson Pharmaceutical Research & Development
Curated by ChEMBL
LigandPNGBDBM50122990(CHEMBL342159 | N-{4-[5-(3-Benzo[1,3]dioxol-5-yl-9-...)
Affinity DataKi:  0.240nM. Assay description: Inhibitory activity against Phosphodiesterase 5 (PDE5) was evaluated
In DepthDetails ArticlePubMed