BDBM50123022 CHEMBL169251
SMILES O=C1\C(CCc2ccccc12)=C/c1c[nH]cn1
InChI Key InChIKey=SEHNFQNDEFTGRO-XFFZJAGNSA-N
Data  1 IC50
  Tab Delimited (TSV)   2D SDfile   Computed 3D by Vconf -m prep SDfile
Find this compound or compounds like it in BindingDB:
Activity Spreadsheet -- Enzyme Inhibition Constant Data from BindingDB
Found 1 hit for monomerid = 50123022
TargetAromatase(Rattus norvegicus)
American University Of Ras Al Khaimah
Curated by ChEMBL
LigandPNGBDBM50123022(CHEMBL169251)
Affinity DataIC50:  260nM. Assay description: Inhibition of rat ovarian aromatase
In DepthDetails ArticlePubMed