BDBM50123094 6,7-Dihydroxy-2-[1-(4-morpholin-4-yl-phenyl)-meth-(E)-ylidene]-benzofuran-3-one::CHEMBL135476
SMILES Oc1ccc2C(=O)\C(Oc2c1O)=C/c1ccc(cc1)N1CCOCC1
InChI Key InChIKey=ZQKMZQAJDUYTJI-LFIBNONCSA-N
Data  1 IC50
  Tab Delimited (TSV)   2D SDfile   Computed 3D by Vconf -m prep SDfile
Find this compound or compounds like it in BindingDB:
Activity Spreadsheet -- Enzyme Inhibition Constant Data from BindingDB
Found 1 hit for monomerid = 50123094
TargetChorismate synthase(Streptococcus pneumoniae)
Pantherix
Curated by ChEMBL
LigandPNGBDBM50123094(6,7-Dihydroxy-2-[1-(4-morpholin-4-yl-phenyl)-meth-...)
Affinity DataIC50: >5.00E+4nM. Assay description: Inhibitory concentration against Streptococcus pneumoniae chorismate synthase
In DepthDetails ArticlePubMed