BDBM50123253 (S)-3-{[5-(3-Guanidinomethyl-phenyl)-thiophene-2-carbonyl]-amino}-2-(2,4,6-trimethyl-benzenesulfonylamino)-propionic acid; TFA::CHEMBL149298
SMILES Cc1cc(C)c(c(C)c1)S(=O)(=O)N[C@@H](CNC(=O)c1ccc(s1)-c1cccc(CNC(N)=N)c1)C(O)=O
InChI Key InChIKey=NKIPTRIPXHQDGW-IBGZPJMESA-N
Data  5 IC50
  Tab Delimited (TSV)   2D SDfile   Computed 3D by Vconf -m prep SDfile
Find this compound or compounds like it in BindingDB:
Activity Spreadsheet -- Enzyme Inhibition Constant Data from BindingDB
Found 5 hits for monomerid = 50123253
TargetIntegrin alpha-V/beta-3(Homo sapiens (Human))
Shire Biochem
Curated by ChEMBL
LigandPNGBDBM50123253((S)-3-{[5-(3-Guanidinomethyl-phenyl)-thiophene-2-c...)
Affinity DataIC50:  11nM. Assay description: Inhibition of fibrinogen binding to integrin alphaV-beta3 receptor
In DepthDetails ArticlePubMed
TargetIntegrin alpha-5/beta-1(Homo sapiens (Human))
Shire Biochem
Curated by ChEMBL
LigandPNGBDBM50123253((S)-3-{[5-(3-Guanidinomethyl-phenyl)-thiophene-2-c...)
Affinity DataIC50:  71nM. Assay description: Inhibition of fibrinogen binding to K562 cells expressing integrin alpha5-beta1
In DepthDetails ArticlePubMed
TargetIntegrin alpha-V/beta-3(Homo sapiens (Human))
Shire Biochem
Curated by ChEMBL
LigandPNGBDBM50123253((S)-3-{[5-(3-Guanidinomethyl-phenyl)-thiophene-2-c...)
Affinity DataIC50:  3.40nM. Assay description: Inhibition of vitronectin binding to HT-29 cells expressing integrin alphaV-beta5
In DepthDetails ArticlePubMed
TargetIntegrin alpha-IIb/beta-3(Homo sapiens (Human))
Shire Biochem
Curated by ChEMBL
LigandPNGBDBM50123253((S)-3-{[5-(3-Guanidinomethyl-phenyl)-thiophene-2-c...)
Affinity DataIC50:  0.160nM. Assay description: Inhibition of fibrinogen binding to K562 cells expressing integrin alphaV-beta3
In DepthDetails ArticlePubMed
TargetIntegrin alpha-V/beta-5(Homo sapiens (Human))
Shire Biochem
Curated by ChEMBL
LigandPNGBDBM50123253((S)-3-{[5-(3-Guanidinomethyl-phenyl)-thiophene-2-c...)
Affinity DataIC50:  11nM. Assay description: Inhibition of fibrinogen binding to K562 cells expressing integrin alpha5-beta1
In DepthDetails ArticlePubMed