BDBM50123674 CHEMBL3622740
SMILES CCCCCC(=O)c1c([nH]c2cc(Cl)ccc12)C(=O)OCC
InChI Key InChIKey=URYYYAISYDBUJX-UHFFFAOYSA-N
Data  1 KI  1 IC50
  Tab Delimited (TSV)   2D SDfile   Computed 3D by Vconf -m prep SDfile
Find this compound or compounds like it in BindingDB:
Activity Spreadsheet -- Enzyme Inhibition Constant Data from BindingDB
Found 2 hits for monomerid = 50123674
TargetPolyunsaturated fatty acid lipoxygenase ALOX15(Homo sapiens (Human))
University Of Groningen
Curated by ChEMBL
LigandPNGBDBM50123674(CHEMBL3622740)
Affinity DataKi:  210nM. Assay description: Competitive inhibition of human 15-LOX1 using linoleic acid as substrate after 10 mins by Lineweaver-Burk plot analysis
In DepthDetails ArticlePubMed
TargetPolyunsaturated fatty acid lipoxygenase ALOX15(Homo sapiens (Human))
University Of Groningen
Curated by ChEMBL
LigandPNGBDBM50123674(CHEMBL3622740)
Affinity DataIC50:  540nM. Assay description: Inhibition of human 15-LOX1 assessed as conversion of linoleic acid to 13(S)-HpODE after 10 mins by UV analysis
In DepthDetails ArticlePubMed