BDBM50123817 1H-Indazole-3-carboxylic acid (1-ethyl-4-methyl-[1,4]diazepan-6-yl)-amide::CHEMBL349048
SMILES CCN1CCN(C)CC(C1)NC(=O)c1[nH]nc2ccccc12
InChI Key InChIKey=NACFTHCDWDMEDV-UHFFFAOYSA-N
Data  2 IC50
  Tab Delimited (TSV)   2D SDfile   Computed 3D by Vconf -m prep SDfile
Find this compound or compounds like it in BindingDB:
Activity Spreadsheet -- Enzyme Inhibition Constant Data from BindingDB
Found 2 hits for monomerid = 50123817
TargetD(2) dopamine receptor(Rattus norvegicus (rat))
Dainippon Pharmaceutical
Curated by ChEMBL
LigandPNGBDBM50123817(1H-Indazole-3-carboxylic acid (1-ethyl-4-methyl-[1...)
Affinity DataIC50: >1.00E+3nM. Assay description: Inhibition of the binding of radioligand [3H]spiperone to dopamine receptor D2 in rat brain synaptic membrane
In DepthDetails ArticlePubMed
Target5-hydroxytryptamine receptor 3A/3B(Rattus norvegicus)
Dainippon Pharmaceutical
Curated by ChEMBL
LigandPNGBDBM50123817(1H-Indazole-3-carboxylic acid (1-ethyl-4-methyl-[1...)
Affinity DataIC50:  6.56nM. Assay description: Concentration required to inhibit the binding of radioligand [3H]GR-65630 to serotonin 5-hydroxytryptamine-3 receptor (5-HT 3 receptor)in rat brain c...
In DepthDetails ArticlePubMed