BDBM50123980 CHEMBL3622787
SMILES NS(=O)(=O)c1ccc(cc1)N1N=C(CC1c1ccc2ccccc2c1)c1ccccc1
InChI Key InChIKey=WHZFAJYEXJWWSI-UHFFFAOYSA-N
Data  3 IC50
  Tab Delimited (TSV)   2D SDfile   Computed 3D by Vconf -m prep SDfile
Find this compound or compounds like it in BindingDB:
Activity Spreadsheet -- Enzyme Inhibition Constant Data from BindingDB
Found 3 hits for monomerid = 50123980
Target72 kDa type IV collagenase(Homo sapiens (Human))
Nanjing University
Curated by ChEMBL
LigandPNGBDBM50123980(CHEMBL3622787)
Affinity DataIC50:  1.26E+4nM. Assay description: Inhibition of APMA-activated human recombinant MMP2 incubated for 5 mins using 4-nitrophenylacetate substrate by esterase assay
In DepthDetails ArticlePubMed
Target72 kDa type IV collagenase(Homo sapiens (Human))
Nanjing University
Curated by ChEMBL
LigandPNGBDBM50123980(CHEMBL3622787)
Affinity DataIC50:  1.26E+4nM. Assay description: Inhibition of APMA-activated human recombinant MMP2 incubated for 5 mins using 4-nitrophenylacetate substrate by esterase assay
In DepthDetails ArticlePubMed
TargetMatrix metalloproteinase-9(Homo sapiens (Human))
Nanjing University
Curated by ChEMBL
LigandPNGBDBM50123980(CHEMBL3622787)
Affinity DataIC50:  3.38E+4nM. Assay description: Inhibition of APMA-activated human recombinant MMP9 incubated for 5 mins using 4-nitrophenylacetate substrate by esterase assay
In DepthDetails ArticlePubMed