BDBM50123991 17-cyclopropylmethyl-1,20-dimethyl-(1S,20R)-5,17-diazapentacyclo[14.3.1.02,14.04,12.06,11]icosa-2(14),3,6(11),7,9,12-hexaene::CHEMBL352365
SMILES C[C@H]1C2Cc3cc4c(cc3[C@@]1(C)CCN2CC1CC1)[nH]c1ccccc41
InChI Key InChIKey=KOODECODLWKEAK-BERSIMOUSA-N
Data  3 KI
  Tab Delimited (TSV)   2D SDfile   Computed 3D by Vconf -m prep SDfile
Find this compound or compounds like it in BindingDB:
Activity Spreadsheet -- Enzyme Inhibition Constant Data from BindingDB
Found 3 hits for monomerid = 50123991
TargetKappa-type opioid receptor(Cavia porcellus (domestic guinea pig))
Rensselaer Polytechnic Institute
Curated by ChEMBL
LigandPNGBDBM50123991(17-cyclopropylmethyl-1,20-dimethyl-(1S,20R)-5,17-d...)
Affinity DataKi:  9.60nM. Assay description: Binding affinity towards Opioid receptor kappa 1 from guinea pig brain using [3H]U69,593 as radioligand
In DepthDetails ArticlePubMed
TargetMu-type opioid receptor(GUINEA PIG)
Rensselaer Polytechnic Institute
Curated by ChEMBL
LigandPNGBDBM50123991(17-cyclopropylmethyl-1,20-dimethyl-(1S,20R)-5,17-d...)
Affinity DataKi:  22nM. Assay description: Binding affinity towards Opioid receptor mu 1 from guinea pig brain using [3H]DAMGO as radioligand
In DepthDetails ArticlePubMed
TargetDelta-type opioid receptor(Homo sapiens (Human))
Rensselaer Polytechnic Institute
Curated by ChEMBL
LigandPNGBDBM50123991(17-cyclopropylmethyl-1,20-dimethyl-(1S,20R)-5,17-d...)
Affinity DataKi:  170nM. Assay description: Binding affinity towards Opioid receptor delta 1 from guinea pig brain using [3H]naltrindole as radioligand
In DepthDetails ArticlePubMed