BDBM50124522 CHEMBL3623709
SMILES Cl.Cl.NCCCC(=O)Nc1ccc2nc([nH]c(=O)c2c1)N1CCNCC1
InChI Key InChIKey=CYLBAXLUYPIGCS-UHFFFAOYSA-N
Data  1 IC50
  Tab Delimited (TSV)   2D SDfile   Computed 3D by Vconf -m prep SDfile
Find this compound or compounds like it in BindingDB:
Activity Spreadsheet -- Enzyme Inhibition Constant Data from BindingDB
Found 1 hit for monomerid = 50124522
TargetIntegrin alpha-2/beta-3(Homo sapiens (Human))
A.V. Bogatsky Physico-Chemical Institute Of The National Academy Of Sciences Of Ukraine
Curated by ChEMBL
LigandPNGBDBM50124522(CHEMBL3623709)
Affinity DataIC50:  11nM. Assay description: Antagonist activity against integrin alpha2bbeta3 closed form in human platelet rich plasma assessed as inhibition of ADP-induced platelet aggregatio...
In DepthDetails ArticlePubMed