BDBM50124529 5-Fluoro-2-(4-fluoro-phenyl)-1,2-dihydro-quinazolin-4-ylamine::CHEMBL354516
SMILES NC1=NC(Nc2cccc(F)c12)c1ccc(F)cc1
InChI Key InChIKey=AKOSZLBIPKPADG-UHFFFAOYSA-N
Data  2 IC50
  Tab Delimited (TSV)   2D SDfile   Computed 3D by Vconf -m prep SDfile
Find this compound or compounds like it in BindingDB:
Activity Spreadsheet -- Enzyme Inhibition Constant Data from BindingDB
Found 2 hits for monomerid = 50124529
TargetNitric oxide synthase, inducible(Homo sapiens (Human))
Astrazeneca R&D Charnwood
Curated by ChEMBL
LigandPNGBDBM50124529(5-Fluoro-2-(4-fluoro-phenyl)-1,2-dihydro-quinazoli...)
Affinity DataIC50:  50nM. Assay description: Inhibitory activity of compound against human inducible nitiric oxide synthase
In DepthDetails ArticlePubMed
TargetNitric oxide synthase, brain(Homo sapiens (Human))
Astrazeneca R&D Charnwood
Curated by ChEMBL
LigandPNGBDBM50124529(5-Fluoro-2-(4-fluoro-phenyl)-1,2-dihydro-quinazoli...)
Affinity DataIC50:  3.50E+3nM. Assay description: Inhibitory activity against human neuronal nitiric oxide synthase
In DepthDetails ArticlePubMed