BDBM50124693 CHEMBL3621544
SMILES Cc1c(Cl)nc(nc1N1CCNCC1)C1CC1
InChI Key InChIKey=YAQPMEHPGFKTPQ-UHFFFAOYSA-N
Data  1 KI
  Tab Delimited (TSV)   2D SDfile   Computed 3D by Vconf -m prep SDfile
Find this compound or compounds like it in BindingDB:
Activity Spreadsheet -- Enzyme Inhibition Constant Data from BindingDB
Found 1 hit for monomerid = 50124693
TargetcAMP and cAMP-inhibited cGMP 3',5'-cyclic phosphodiesterase 10A(Homo sapiens (Human))
Merck Research Laboratories
Curated by ChEMBL
LigandPNGBDBM50124693(CHEMBL3621544)
Affinity DataKi:  4.60E+3nM. Assay description: Inhibition of human PDE10A2 transfected in AD293 cells by IMAP FP assay
In DepthDetails ArticlePubMed