BDBM50124945 (4-{(4-Bromo-phenyl)-[(Z)-ethoxyimino]-methyl}-4'-methyl-[1,4']bipiperidinyl-1'-yl)-(3,5-dimethyl-1-oxy-pyridin-4-yl)-methanone::CHEMBL137856::CHEMBL161664
SMILES CCO[N-][C+](C1CCN(CC1)C1(C)CCN(CC1)C(=O)c1c(C)c[n+]([O-])cc1C)c1ccc(Br)cc1
InChI Key InChIKey=GOONFQIXEZVCEW-UHFFFAOYSA-N
Data  2 KI
  Tab Delimited (TSV)   2D SDfile   Computed 3D by Vconf -m prep SDfile
Find this compound or compounds like it in BindingDB:
Activity Spreadsheet -- Enzyme Inhibition Constant Data from BindingDB
Found 2 hits for monomerid = 50124945
TargetC-C chemokine receptor type 5(Homo sapiens (Human))
Lindsley F. Kimball Research Institute
Curated by ChEMBL
LigandPNGBDBM50124945((4-{(4-Bromo-phenyl)-[(Z)-ethoxyimino]-methyl}-4'-...)
Affinity DataKi:  8.80nM. Assay description: Inhibition of RANTES binding to the human C-C chemokine receptor type 5 (CCR5)
In DepthDetails ArticlePubMed
TargetC-C chemokine receptor type 5(Homo sapiens (Human))
Lindsley F. Kimball Research Institute
Curated by ChEMBL
LigandPNGBDBM50124945((4-{(4-Bromo-phenyl)-[(Z)-ethoxyimino]-methyl}-4'-...)
Affinity DataKi:  8.80nM. Assay description: Inhibition of [125I]RANTES binding to CCR5 receptor.
In DepthDetails ArticlePubMed