BDBM50125086 CHEMBL3622992
SMILES OCCN1CCc2c([nH]c3ccccc23)C1c1ccc(Cl)cc1
InChI Key InChIKey=KJENGQHGPDRMLH-UHFFFAOYSA-N
Data  7 IC50
  Tab Delimited (TSV)   2D SDfile   Computed 3D by Vconf -m prep SDfile
Find this compound or compounds like it in BindingDB:
Activity Spreadsheet -- Enzyme Inhibition Constant Data from BindingDB
Found 7 hits for monomerid = 50125086
TargetProgesterone receptor(Homo sapiens (Human))
Astrazeneca
Curated by ChEMBL
LigandPNGBDBM50125086(CHEMBL3622992)
Affinity DataIC50:  2.69E+3nM. Assay description: Antagonist activity at progesterone receptor in human MCF cells assessed as estradiol-induced receptor response
In DepthDetails ArticlePubMed
TargetProgesterone receptor(Homo sapiens (Human))
Astrazeneca
Curated by ChEMBL
LigandPNGBDBM50125086(CHEMBL3622992)
Affinity DataIC50: <1.00E+5nM. Assay description: Agonist activity at progesterone receptor in human MCF7 cells
In DepthDetails ArticlePubMed
TargetEstrogen receptor(Homo sapiens (Human))
Astrazeneca
Curated by ChEMBL
LigandPNGBDBM50125086(CHEMBL3622992)
Affinity DataIC50:  1.18E+3nM. Assay description: Antagonist activity at ERalpha receptor in human MCF7 cells
In DepthDetails ArticlePubMed
TargetGlucocorticoid receptor(Homo sapiens (Human))
Astrazeneca
Curated by ChEMBL
LigandPNGBDBM50125086(CHEMBL3622992)
Affinity DataIC50: <3.16E+4nM. Assay description: Binding affinity to glucocorticoid receptor (unknown origin)
In DepthDetails ArticlePubMed
TargetAndrogen receptor(Homo sapiens (Human))
Astrazeneca
Curated by ChEMBL
LigandPNGBDBM50125086(CHEMBL3622992)
Affinity DataIC50: <3.16E+4nM. Assay description: Binding affinity to androgen receptor (unknown origin)
In DepthDetails ArticlePubMed
TargetProgesterone receptor(Homo sapiens (Human))
Astrazeneca
Curated by ChEMBL
LigandPNGBDBM50125086(CHEMBL3622992)
Affinity DataIC50: <3.16E+4nM. Assay description: Binding affinity to progesterone receptor (unknown origin)
In DepthDetails ArticlePubMed
TargetEstrogen receptor(Homo sapiens (Human))
Astrazeneca
Curated by ChEMBL
LigandPNGBDBM50125086(CHEMBL3622992)
Affinity DataIC50:  2.04E+3nM. Assay description: Binding affinity to ERalpha receptor (unknown origin)
In DepthDetails ArticlePubMed