BDBM50125287 (S)-2-(2,5-Dimethoxy-benzenesulfonylamino)-3-[3'-(3-propyl-ureido)-biphenyl-4-yl]-propionic acid::CHEMBL10965
SMILES CCCNC(=O)Nc1cccc(c1)-c1ccc(C[C@H](NS(=O)(=O)c2cc(OC)ccc2OC)C(O)=O)cc1
InChI Key InChIKey=AJTNPMHRYFFXGR-QHCPKHFHSA-N
Data  1 KI
  Tab Delimited (TSV)   2D SDfile   Computed 3D by Vconf -m prep SDfile
Find this compound or compounds like it in BindingDB:
Activity Spreadsheet -- Enzyme Inhibition Constant Data from BindingDB
Found 1 hit for monomerid = 50125287
TargetIntegrin alpha-V/beta-3(Homo sapiens (Human))
Bayer
Curated by ChEMBL
LigandPNGBDBM50125287((S)-2-(2,5-Dimethoxy-benzenesulfonylamino)-3-[3'-(...)
Affinity DataKi:  500nM. Assay description: Binding affinity towards vitronectin receptor (alpha V-beta3) was determined
In DepthDetails ArticlePubMed