BDBM50125891 CHEMBL18853::N-{2-(1H-Indol-3-yl)-1-[(R)-(R)-2-(1H-indol-3-yl)-1-propionylamino-ethylcarbamoyl]-ethyl}-2-methyl-2-methylamino-propionamide
SMILES CCC(=O)N[C@@H](Cc1c[nH]c2ccccc12)NC(=O)[C@@H](Cc1c[nH]c2ccccc12)NC(=O)C(C)(C)NC
InChI Key InChIKey=LGZCTGHFNMARJF-JWQCQUIFSA-N
Data  2 IC50
  Tab Delimited (TSV)   2D SDfile   Computed 3D by Vconf -m prep SDfile
Find this compound or compounds like it in BindingDB:
Activity Spreadsheet -- Enzyme Inhibition Constant Data from BindingDB
Found 2 hits for monomerid = 50125891
TargetGrowth hormone secretagogue receptor type 1(Homo sapiens (Human))
University Of Montpellier
Curated by ChEMBL
LigandPNGBDBM50125891(CHEMBL18853 | N-{2-(1H-Indol-3-yl)-1-[(R)-(R)-2-(1...)
Affinity DataIC50:  167nM. Assay description: Binding affinity towards cloned human Growth hormone secretagogue receptor type I in LLC PK-1 cells using [125I][His9]-ghrelin as radioligand
In DepthDetails ArticlePubMed
TargetGrowth hormone secretagogue receptor type 1(Homo sapiens (Human))
University Of Montpellier
Curated by ChEMBL
LigandPNGBDBM50125891(CHEMBL18853 | N-{2-(1H-Indol-3-yl)-1-[(R)-(R)-2-(1...)
Affinity DataIC50: >1.00E+4nM. Assay description: Binding affinity towards human pituitary Growth hormone secretagogue receptor using [125I][Tyr4]-ghrelin as radioligand
In DepthDetails ArticlePubMed