BDBM50125919 2-(5-Morpholin-4-ylmethyl-furan-2-yl)-7-phenethyl-7H-pyrazolo[4,3-e][1,2,4]triazolo[1,5-c]pyrimidin-5-ylamine::CHEMBL278331
SMILES Nc1nc2n(CCc3ccccc3)ncc2c2nc(nn12)-c1ccc(CN2CCOCC2)o1
InChI Key InChIKey=GYPRVBBSXWSJFC-UHFFFAOYSA-N
Data  4 KI
  Tab Delimited (TSV)   2D SDfile   Computed 3D by Vconf -m prep SDfile
Find this compound or compounds like it in BindingDB:
Activity Spreadsheet -- Enzyme Inhibition Constant Data from BindingDB
Found 4 hits for monomerid = 50125919
TargetAdenosine receptor A3(Homo sapiens (Human))
Universit£
Curated by ChEMBL
LigandPNGBDBM50125919(2-(5-Morpholin-4-ylmethyl-furan-2-yl)-7-phenethyl-...)
Affinity DataKi: >1.00E+3nM. Assay description: Displacement of [3H]- MRE 308F20 binding from human Adenosine A3 receptor expressed in CHO cells
In DepthDetails ArticlePubMed
TargetAdenosine receptor A2a(Homo sapiens (Human))
Universit£
Curated by ChEMBL
LigandPNGBDBM50125919(2-(5-Morpholin-4-ylmethyl-furan-2-yl)-7-phenethyl-...)
Affinity DataKi: >1.00E+3nM. Assay description: Displacement of [3H]SCH-58261 from human Adenosine A2A receptor expressed in CHO cells
In DepthDetails ArticlePubMed
TargetAdenosine receptor A2b(Homo sapiens (Human))
Universit£
Curated by ChEMBL
LigandPNGBDBM50125919(2-(5-Morpholin-4-ylmethyl-furan-2-yl)-7-phenethyl-...)
Affinity DataKi: >1.00E+3nM. Assay description: Displacement of [3H]- DPCPX from human adenosine A2B receptor expressed in HEK293 cells
In DepthDetails ArticlePubMed
TargetAdenosine receptor A1(Homo sapiens (Human))
Universit£
Curated by ChEMBL
LigandPNGBDBM50125919(2-(5-Morpholin-4-ylmethyl-furan-2-yl)-7-phenethyl-...)
Affinity DataKi: >1.00E+3nM. Assay description: Displacement of [3H]- DPCPX binding at human Adenosine A1 receptor expressed in CHO cells
In DepthDetails ArticlePubMed