BDBM50126186 2-(3-Naphthalen-2-yl-but-2-enoylamino)-benzoic acid::CHEMBL27323
SMILES C\C(=C/C(=O)Nc1ccccc1C(O)=O)c1ccc2ccccc2c1
InChI Key InChIKey=PGFQXGLPJUCTOI-WYMLVPIESA-N
Data  12 IC50
PDB links: 1 PDB ID matches this monomer.
  Tab Delimited (TSV)   2D SDfile   Computed 3D by Vconf -m prep SDfile
Find this compound or compounds like it in BindingDB:
Activity Spreadsheet -- Enzyme Inhibition Constant Data from BindingDB
Found 12 hits for monomerid = 50126186
TargetTelomerase reverse transcriptase(Homo sapiens (Human))
University Of Texas At Dallas
Curated by ChEMBL
LigandPNGBDBM50126186(2-(3-Naphthalen-2-yl-but-2-enoylamino)-benzoic aci...)
Affinity DataIC50:  5.00E+3nM. Assay description: Inhibitory activity of the compound against telomerase
In DepthDetails ArticlePubMed
TargetTelomerase reverse transcriptase(Homo sapiens (Human))
University Of Texas At Dallas
Curated by ChEMBL
LigandPNGBDBM50126186(2-(3-Naphthalen-2-yl-but-2-enoylamino)-benzoic aci...)
Affinity DataIC50:  280nM. Assay description: Inhibition of telomerase in human MGC803 cells after 24 hrs by TRAP-PCR-ELISA
In DepthDetails ArticlePubMed
TargetTelomerase reverse transcriptase(Homo sapiens (Human))
University Of Texas At Dallas
Curated by ChEMBL
LigandPNGBDBM50126186(2-(3-Naphthalen-2-yl-but-2-enoylamino)-benzoic aci...)
Affinity DataIC50:  410nM. Assay description: Inhibition of telomerase in human MGC803 cell extracts after 24 hrs by TRAP-PCR-ELISA
In DepthDetails ArticlePubMed
TargetTelomerase reverse transcriptase(Homo sapiens (Human))
University Of Texas At Dallas
Curated by ChEMBL
LigandPNGBDBM50126186(2-(3-Naphthalen-2-yl-but-2-enoylamino)-benzoic aci...)
Affinity DataIC50:  170nM. Assay description: Inhibition of telomerase in human MDA-MB-231 cells after 24 hrs by TRAP-PCR-ELISA
In DepthDetails ArticlePubMed
TargetTelomerase reverse transcriptase(Homo sapiens (Human))
University Of Texas At Dallas
Curated by ChEMBL
LigandPNGBDBM50126186(2-(3-Naphthalen-2-yl-but-2-enoylamino)-benzoic aci...)
Affinity DataIC50:  93nM. Assay description: Inhibition of human telomerase
In DepthDetails ArticlePubMed
TargetTelomerase reverse transcriptase(Homo sapiens (Human))
University Of Texas At Dallas
Curated by ChEMBL
LigandPNGBDBM50126186(2-(3-Naphthalen-2-yl-but-2-enoylamino)-benzoic aci...)
Affinity DataIC50:  1.16E+4nM. Assay description: Inhibition of telomerase activity (unknown origin) in cell free system using sulforhodamine labeled primer measured after 30 mins by telomerase repea...
In DepthDetails ArticlePubMed
TargetTelomerase reverse transcriptase(Homo sapiens (Human))
University Of Texas At Dallas
Curated by ChEMBL
LigandPNGBDBM50126186(2-(3-Naphthalen-2-yl-but-2-enoylamino)-benzoic aci...)
Affinity DataIC50:  4.60E+3nM. Assay description: Inhibition of telomerase in human HeLa cells using 5'-AAT CCG TCG AGC AGA GTT-3' as substrate incubated for 15 mins prior to extension reaction follo...
In DepthDetails ArticlePubMed
TargetTelomerase reverse transcriptase(Homo sapiens (Human))
University Of Texas At Dallas
Curated by ChEMBL
LigandPNGBDBM50126186(2-(3-Naphthalen-2-yl-but-2-enoylamino)-benzoic aci...)
Affinity DataIC50:  3.60E+3nM. Assay description: Inhibition of telomerase in human HeLa cells using 5'-AAT CCG TCG AGC AGA GTT-3' as substrate incubated for 15 mins prior to extension reaction by te...
In DepthDetails ArticlePubMed
TargetTelomerase reverse transcriptase(Homo sapiens (Human))
University Of Texas At Dallas
Curated by ChEMBL
LigandPNGBDBM50126186(2-(3-Naphthalen-2-yl-but-2-enoylamino)-benzoic aci...)
Affinity DataIC50:  93nM. Assay description: Inhibition of human telomerase isolated from human HeLa cells nuclear extracts expressed in insect cells assessed as [33P]dCMP incorporation after 30...
In DepthDetails ArticlePubMed
TargetTelomerase reverse transcriptase(Homo sapiens (Human))
University Of Texas At Dallas
Curated by ChEMBL
LigandPNGBDBM50126186(2-(3-Naphthalen-2-yl-but-2-enoylamino)-benzoic aci...)
Affinity DataIC50:  280nM. Assay description: Inhibition of telomerase in human MGC803 cell extracts after 24 hrs by TRAP-PCR-ELISA
In DepthDetails ArticlePubMed
TargetTelomerase reverse transcriptase(Homo sapiens (Human))
University Of Texas At Dallas
Curated by ChEMBL
LigandPNGBDBM50126186(2-(3-Naphthalen-2-yl-but-2-enoylamino)-benzoic aci...)
Affinity DataIC50:  3.60E+3nM. Assay description: Inhibition of human telomerase activity isolated from HEK293 cells assessed as reduction in dNTP incorporation using 5'-biotinylated AATCCGTCGAGCAGAG...
In DepthDetails ArticlePubMed
TargetTelomerase reverse transcriptase(Homo sapiens (Human))
University Of Texas At Dallas
Curated by ChEMBL
LigandPNGBDBM50126186(2-(3-Naphthalen-2-yl-but-2-enoylamino)-benzoic aci...)
Affinity DataIC50:  93nM. Assay description: Inhibition of telomerase in human HeLa cells after 2 hrs by [alpha-32P]dGTP incorporation assay
In DepthDetails ArticlePubMed