BDBM50126487 CHEMBL34614::N-(6-Amino-2-methyl-pyridin-3-ylmethyl)-2-(2-cyclobutyl-7-methyl-1,1,5-trioxo-1,3,4,5-tetrahydro-2H-1lambda*6*-thia-2,4,6-triaza-naphthalen-6-yl)-acetamide
SMILES Cc1cc2c(NCN(C3CCC3)S2(=O)=O)c(=O)n1CC(=O)NCc1ccc(N)nc1C
InChI Key InChIKey=KRSIBXQGZMDDMM-UHFFFAOYSA-N
Data  2 KI
  Tab Delimited (TSV)   2D SDfile   Computed 3D by Vconf -m prep SDfile
Find this compound or compounds like it in BindingDB:
Activity Spreadsheet -- Enzyme Inhibition Constant Data from BindingDB
Found 2 hits for monomerid = 50126487
TargetProthrombin(Homo sapiens (Human))
Merck Research Laboratories
Curated by ChEMBL
LigandPNGBDBM50126487(CHEMBL34614 | N-(6-Amino-2-methyl-pyridin-3-ylmeth...)
Affinity DataKi:  10nM. Assay description: Inhibition of human thrombin
In DepthDetails ArticlePubMed
TargetSerine protease 1(Homo sapiens (Human))
Merck Research Laboratories
Curated by ChEMBL
LigandPNGBDBM50126487(CHEMBL34614 | N-(6-Amino-2-methyl-pyridin-3-ylmeth...)
Affinity DataKi:  6.30E+3nM. Assay description: Inhibitory activity of the compound against human trypsin
In DepthDetails ArticlePubMed