BDBM50126564 4-{5-[3-Benzyl-2,4-dioxo-5-((2E,6E)-3,7,11-trimethyl-dodeca-2,6,10-trienyl)-imidazolidin-1-ylmethyl]-imidazol-1-ylmethyl}-benzonitrile::CHEMBL32863
SMILES [#6]\[#6](-[#6])=[#6]/[#6]-[#6]\[#6](-[#6])=[#6]\[#6]-[#6]\[#6](-[#6])=[#6]\[#6]-c1c(-[#8])n(-[#6]-c2ccccc2)c(=O)n1-[#6]-c1cncn1-[#6]-c1ccc(cc1)C#N
InChI Key InChIKey=JNEDKPBHLDVQGB-XVGJRRPCSA-N
Data  1 IC50
  Tab Delimited (TSV)   2D SDfile   Computed 3D by Vconf -m prep SDfile
Find this compound or compounds like it in BindingDB:
Activity Spreadsheet -- Enzyme Inhibition Constant Data from BindingDB
Found 1 hit for monomerid = 50126564
TargetProtein farnesyltransferase subunit beta/geranylgeranyltransferase type-1 subunit alpha(Bos taurus (bovine))
Centre De Recherche Pierre Fabre
Curated by ChEMBL
LigandPNGBDBM50126564(4-{5-[3-Benzyl-2,4-dioxo-5-((2E,6E)-3,7,11-trimeth...)
Affinity DataIC50:  200nM. Assay description: In vitro inhibition of bovine Farnesyl transferase
In DepthDetails ArticlePubMed