BDBM50126658 CHEMBL438571::Compound Venorphin
SMILES CC(C)C[C@H](NC(=O)[C@H](Cc1c[nH]c2ccccc12)NC(=O)[C@H](Cc1c[nH]c2ccccc12)NC(=O)[C@H](CCCCN)NC(=O)[C@H](Cc1ccc(O)cc1)NC(C)=O)C(=O)N[C@@H](CCCNC(N)=N)C(=O)N[C@@H](CCCNC(N)=N)C(=O)N[C@@H](C)C(=O)N[C@@H](CCCNC(N)=N)C(=O)N1CCC[C@H]1C(=O)N[C@@H](CCCCN)C(N)=O
InChI Key InChIKey=BRVWVZJLUPHDEY-ZKVIZJJYSA-N
Data  3 KI
  Tab Delimited (TSV)   2D SDfile   Computed 3D by Vconf -m prep SDfile
Find this compound or compounds like it in BindingDB:
Activity Spreadsheet -- Enzyme Inhibition Constant Data from BindingDB
Found 3 hits for monomerid = 50126658
TargetKappa-type opioid receptor(Cavia porcellus (domestic guinea pig))
University Of Maryland
Curated by ChEMBL
LigandPNGBDBM50126658(CHEMBL438571 | Compound Venorphin)
Affinity DataKi:  20nM. Assay description: Binding affinity of the compound towards Opioid receptor kappa 1 using [3H]-Diprenorphine as radioligand in Chinese hamster ovary cells expressing cl...
In DepthDetails ArticlePubMed
TargetMu-type opioid receptor(Homo sapiens (Human))
University Of Maryland
Curated by ChEMBL
LigandPNGBDBM50126658(CHEMBL438571 | Compound Venorphin)
Affinity DataKi:  251nM. Assay description: Binding affinity of the compound towards Opioid receptor mu 1 using [3H]-DAMGO as radioligand in Chinese hamster ovary cells expressing cloned opioid...
In DepthDetails ArticlePubMed
TargetDelta-type opioid receptor(Rattus norvegicus (rat))
University Of Maryland
Curated by ChEMBL
LigandPNGBDBM50126658(CHEMBL438571 | Compound Venorphin)
Affinity DataKi:  5.32E+3nM. Assay description: Binding affinity of the compound towards Opioid receptor delta 1 using [3H]-DPDPE as radioligand in Chinese hamster ovary cells expressing cloned opi...
In DepthDetails ArticlePubMed