BDBM50126661 (2S)-2-[(2,4-DICHLORO-BENZOYL)-(3-TRIFLUOROMETHYL-BENZYL)-AMINO]-3-PHENYL-PROPIONIC ACID::(S)-2-(2,4-dichloro-N-(3-(trifluoromethyl)benzyl)benzamido)-3-phenylpropanoic acid::(S)-2-[(2,4-Dichloro-benzoyl)-(3-trifluoromethyl-benzyl)-amino]-3-phenyl-propionic acid::2-[(2,4-Dichloro-benzoyl)-(3-trifluoromethyl-benzyl)-amino]-3-phenyl-propionic acid::CHEMBL24547
SMILES OC(=O)[C@H](Cc1ccccc1)N(Cc1cccc(c1)C(F)(F)F)C(=O)c1ccc(Cl)cc1Cl
InChI Key InChIKey=LAJJKGIZTCCOHY-NRFANRHFSA-N
Data  1 KI  1 IC50
PDB links: 1 PDB ID matches this monomer.
  Tab Delimited (TSV)   2D SDfile   Computed 3D by Vconf -m prep SDfile
Find this compound or compounds like it in BindingDB:
Activity Spreadsheet -- Enzyme Inhibition Constant Data from BindingDB
Found 2 hits for monomerid = 50126661
TargetGenome polyprotein(Hepatitis C virus)
University Of Wollongong
Curated by ChEMBL
LigandPNGBDBM50126661((2S)-2-[(2,4-DICHLORO-BENZOYL)-(3-TRIFLUOROMETHYL-...)
Affinity DataKi:  2.20E+3nM. Assay description: Inhibitory constant against hepatitis C virus NS3 protease
In DepthDetails ArticlePubMed
TargetRNA-directed RNA polymerase(Hepatitis C virus)
Shire Biochem
Curated by ChEMBL
LigandPNGBDBM50126661((2S)-2-[(2,4-DICHLORO-BENZOYL)-(3-TRIFLUOROMETHYL-...)
Affinity DataIC50:  1.70E+3nM. Assay description: Inhibitory activity against Hepatitis C RNA dependent RNA polymerase Nonstructural protein 5B (NS5B polymerase) expressed from baculovirus-infected S...
In DepthDetails ArticlePubMed