BDBM50127360 CHEMBL290919::N-(4-{(R)-2-[({(S)-3-[(3-Phenyl-ureido)-methyl]-3,4-dihydro-1H-isoquinoline-2-carbothioyl}-amino)-methyl]-pyrrolidin-1-ylmethyl}-phenyl)-acetamide
SMILES CC(=O)Nc1ccc(CN2CCC[C@@H]2CNC(=S)N2Cc3ccccc3C[C@H]2CNC(=O)Nc2ccccc2)cc1
InChI Key InChIKey=RFMDABBQJCWFGN-IHLOFXLRSA-N
Data  1 KI
  Tab Delimited (TSV)   2D SDfile   Computed 3D by Vconf -m prep SDfile
Find this compound or compounds like it in BindingDB:
Activity Spreadsheet -- Enzyme Inhibition Constant Data from BindingDB
Found 1 hit for monomerid = 50127360
TargetMu-type opioid receptor(Homo sapiens (Human))
Astrazeneca R&D Montreal
Curated by ChEMBL
LigandPNGBDBM50127360(CHEMBL290919 | N-(4-{(R)-2-[({(S)-3-[(3-Phenyl-ure...)
Affinity DataKi:  10nM. Assay description: Binding affinity for mu opioid receptor
In DepthDetails ArticlePubMed