BDBM50127363 (S)-3-[(3-Phenyl-ureido)-methyl]-3,4-dihydro-1H-isoquinoline-2-carbothioic acid ((R)-1-thiophen-3-ylmethyl-pyrrolidin-2-ylmethyl)-amide::CHEMBL40528
SMILES O=C(NC[C@@H]1Cc2ccccc2CN1C(=S)NC[C@H]1CCCN1Cc1ccsc1)Nc1ccccc1
InChI Key InChIKey=RDWLSMJKDZGGQQ-FTJBHMTQSA-N
Data  1 KI
  Tab Delimited (TSV)   2D SDfile   Computed 3D by Vconf -m prep SDfile
Find this compound or compounds like it in BindingDB:
Activity Spreadsheet -- Enzyme Inhibition Constant Data from BindingDB
Found 1 hit for monomerid = 50127363
TargetMu-type opioid receptor(Homo sapiens (Human))
Astrazeneca R&D Montreal
Curated by ChEMBL
LigandPNGBDBM50127363((S)-3-[(3-Phenyl-ureido)-methyl]-3,4-dihydro-1H-is...)
Affinity DataKi:  24nM. Assay description: Binding affinity for mu opioid receptor
In DepthDetails ArticlePubMed