BDBM50127528 3-(1H-Indol-3-yl)-N-phenethyl-2-[2-(2-1,2,3,4-tetrahydro-isoquinolin-1-yl-acetylamino)-propionylamino]-propionamide::CHEMBL57167
SMILES CC(NC(=O)CC1NCCc2ccccc12)C(=O)NC(Cc1c[nH]c2ccccc12)C(=O)NCCc1ccccc1
InChI Key InChIKey=CFKSTPUYLNWQPP-UHFFFAOYSA-N
Data  1 EC50
  Tab Delimited (TSV)   2D SDfile   Computed 3D by Vconf -m prep SDfile
Find this compound or compounds like it in BindingDB:
Activity Spreadsheet -- Enzyme Inhibition Constant Data from BindingDB
Found 1 hit for monomerid = 50127528
TargetBombesin receptor subtype-3(Homo sapiens (Human))
Technische UniversitäT MüNchen
Curated by ChEMBL
LigandPNGBDBM50127528(3-(1H-Indol-3-yl)-N-phenethyl-2-[2-(2-1,2,3,4-tetr...)
Affinity DataEC50:  310nM. Assay description: Effective concentration required against human bombesin receptor 3 (BRS-3) in CHO cells by using FLIPR assay.
In DepthDetails ArticlePubMed