BDBM50127529 2-[2-(4-Chloro-benzylamino)-acetylamino]-3-(1H-indol-3-yl)-N-phenethyl-propionamide::CHEMBL57039
SMILES Clc1ccc(CNCC(=O)NC(Cc2c[nH]c3ccccc23)C(=O)NCCc2ccccc2)cc1
InChI Key InChIKey=OQMVEWCTQRVEHK-UHFFFAOYSA-N
Data  1 EC50
  Tab Delimited (TSV)   2D SDfile   Computed 3D by Vconf -m prep SDfile
Find this compound or compounds like it in BindingDB:
Activity Spreadsheet -- Enzyme Inhibition Constant Data from BindingDB
Found 1 hit for monomerid = 50127529
TargetBombesin receptor subtype-3(Homo sapiens (Human))
Technische UniversitäT MüNchen
Curated by ChEMBL
LigandPNGBDBM50127529(2-[2-(4-Chloro-benzylamino)-acetylamino]-3-(1H-ind...)
Affinity DataEC50:  2.90nM. Assay description: Effective concentration required against human bombesin receptor 3 (BRS-3) in CHO cells by using FLIPR assay.
In DepthDetails ArticlePubMed