BDBM50127793 CHEMBL48797::Oxazole-5-carboxylic acid [2-(2,2,2-trifluoro-1-hydroxy-1-trifluoromethyl-ethyl)-naphthalen-1-yl]-amide
SMILES OC(c1ccc2ccccc2c1NC(=O)c1cnco1)(C(F)(F)F)C(F)(F)F
InChI Key InChIKey=ZLLRSPYUTRWAPN-UHFFFAOYSA-N
Data  1 EC50
  Tab Delimited (TSV)   2D SDfile   Computed 3D by Vconf -m prep SDfile
Find this compound or compounds like it in BindingDB:
Activity Spreadsheet -- Enzyme Inhibition Constant Data from BindingDB
Found 1 hit for monomerid = 50127793
TargetATP-sensitive inward rectifier potassium channel 11(Homo sapiens (Human))
Abbott Laboratories
Curated by ChEMBL
LigandPNGBDBM50127793(CHEMBL48797 | Oxazole-5-carboxylic acid [2-(2,2,2-...)
Affinity DataEC50:  24nM. Assay description: Potassium channel opening activity in vitro using LtK cells transfected with Kir6.2/SUR2B exon 17
In DepthDetails ArticlePubMed