BDBM50127814 4-(3,4-Dihydro-1H-isoquinolin-2-yl)-pyridin-2-ylamine::CHEMBL299419
SMILES Nc1cc(ccn1)N1CCc2ccccc2C1
InChI Key InChIKey=SNEWDBZYBSANKX-UHFFFAOYSA-N
Data  2 KI
  Tab Delimited (TSV)   2D SDfile   Computed 3D by Vconf -m prep SDfile
Find this compound or compounds like it in BindingDB:
Activity Spreadsheet -- Enzyme Inhibition Constant Data from BindingDB
Found 2 hits for monomerid = 50127814
TargetMuscarinic acetylcholine receptor M1(RAT)
F. Hoffmann-La Roche
Curated by ChEMBL
LigandPNGBDBM50127814(4-(3,4-Dihydro-1H-isoquinolin-2-yl)-pyridin-2-ylam...)
Affinity DataKi:  400nM. Assay description: Binding affinity towards Muscarinic acetylcholine receptor M1 in rat heart using [3H]-pirenzepine as radioligand
In DepthDetails ArticlePubMed
TargetAlpha-1A/Alpha-1B/Alpha-1D adrenergic receptor(Rattus norvegicus (rat))
F. Hoffmann-La Roche
Curated by ChEMBL
LigandPNGBDBM50127814(4-(3,4-Dihydro-1H-isoquinolin-2-yl)-pyridin-2-ylam...)
Affinity DataKi:  2.10E+3nM. Assay description: Binding affinity towards alpha receptor in rat brain using [3H]prazosin as radioligand
In DepthDetails ArticlePubMed