BDBM50128107 1-[2-(4-Chloro-phenoxy)-1-methyl-ethyl]-4-methyl-piperidine; hydrochloride::CHEMBL555790
SMILES C[C@@H](COc1ccc(Cl)cc1)N1CCC(C)CC1
InChI Key InChIKey=YMXSQORRHQQKJH-ZDUSSCGKSA-N
Data  4 KI
  Tab Delimited (TSV)   2D SDfile   Computed 3D by Vconf -m prep SDfile
Find this compound or compounds like it in BindingDB:
Activity Spreadsheet -- Enzyme Inhibition Constant Data from BindingDB
Found 4 hits for monomerid = 50128107
TargetSigma non-opioid intracellular receptor 1(Homo sapiens (Human))
Universit£
Curated by ChEMBL
LigandPNGBDBM50128107(1-[2-(4-Chloro-phenoxy)-1-methyl-ethyl]-4-methyl-p...)
Affinity DataKi:  0.340nM. Assay description: Inhibition of [3H]pentazocine binding to Sigma receptor type 1 in guinea pig brain membrane without cerebellum
In DepthDetails ArticlePubMed
TargetSigma non-opioid intracellular receptor 1(Cavia porcellus (Guinea pig))
Universit£
Curated by ChEMBL
LigandPNGBDBM50128107(1-[2-(4-Chloro-phenoxy)-1-methyl-ethyl]-4-methyl-p...)
Affinity DataKi:  0.340nM. Assay description: Displacement of [3H](+)-pentazocine from sigma 1 receptor in guinea pig brain membranes measured after 120 mins by scintillation counting method
In DepthDetails ArticlePubMed
Target3-beta-hydroxysteroid-Delta(8),Delta(7)-isomerase(Cavia porcellus)
Universit£
Curated by ChEMBL
LigandPNGBDBM50128107(1-[2-(4-Chloro-phenoxy)-1-methyl-ethyl]-4-methyl-p...)
Affinity DataKi:  3.73nM. Assay description: Inhibition of [3H]-emopamil binding to Sterol delta 8-delta 7 isomerase in guinea pig liver membrane
In DepthDetails ArticlePubMed
TargetSigma intracellular receptor 2(Rattus norvegicus (Rat))
Universit£
Curated by ChEMBL
LigandPNGBDBM50128107(1-[2-(4-Chloro-phenoxy)-1-methyl-ethyl]-4-methyl-p...)
Affinity DataKi:  186nM. Assay description: Displacement of [3H]DTG from sigma 2 receptor in Wistar Han rat liver membranes measured after 120 mins by scintillation counting method
In DepthDetails ArticlePubMed