BDBM50128118 CHEMBL3628111
SMILES Cc1ccoc1C(=O)Nc1ccc(N2C(=O)c3cccc(Cl)c3C2=O)c(Cl)c1
InChI Key InChIKey=BRKUTQGSVAOCPC-UHFFFAOYSA-N
Data  4 EC50
  Tab Delimited (TSV)   2D SDfile   Computed 3D by Vconf -m prep SDfile
Find this compound or compounds like it in BindingDB:
Activity Spreadsheet -- Enzyme Inhibition Constant Data from BindingDB
Found 4 hits for monomerid = 50128118
TargetMetabotropic glutamate receptor 1(Homo sapiens (Human))
Vanderbilt University
Curated by ChEMBL
LigandPNGBDBM50128118(CHEMBL3628111)
Affinity DataEC50:  33nM. Assay description: Positive allosteric modulation of human mGlu1 receptor in HEK293 cells assessed as potentiation of glutamate-induced calcium mobiliztion by Fluo-4AM ...
In DepthDetails ArticlePubMed
TargetMetabotropic glutamate receptor 1(Homo sapiens (Human))
Vanderbilt University
Curated by ChEMBL
LigandPNGBDBM50128118(CHEMBL3628111)
Affinity DataEC50:  33nM. Assay description: Positive allosteric modulation of human mGlu1 receptor in HEK293 cells assessed as potentiation of glutamate-induced calcium mobiliztion by Fluo-4AM ...
In DepthDetails ArticlePubMed
TargetMetabotropic glutamate receptor 4(Homo sapiens (Human))
Vanderbilt University
Curated by ChEMBL
LigandPNGBDBM50128118(CHEMBL3628111)
Affinity DataEC50:  1.14E+3nM. Assay description: Positive allosteric modulation of human mGlu4 receptor assessed as potentiation of glutamate-induced calcium mobiliztion by cell based assay
In DepthDetails ArticlePubMed
TargetMetabotropic glutamate receptor 4(Homo sapiens (Human))
Vanderbilt University
Curated by ChEMBL
LigandPNGBDBM50128118(CHEMBL3628111)
Affinity DataEC50:  1.15E+3nM. Assay description: Positive allosteric modulation of human mGlu4 receptor assessed as potentiation of glutamate-induced calcium mobiliztion by cell based assay
In DepthDetails ArticlePubMed