BDBM50128299 4-Methyl-benzo[1,3]dioxole-5-carboxylic acid [1-(3,5-dimethyl-benzoyl)-cyclohexyl]-amide::CHEMBL294845
SMILES Cc1cc(C)cc(c1)C(=O)C1(CCCCC1)NC(=O)c1ccc2OCOc2c1C
InChI Key InChIKey=FEUFKYIMDJWZJV-UHFFFAOYSA-N
Data  2 EC50
  Tab Delimited (TSV)   2D SDfile   Computed 3D by Vconf -m prep SDfile
Find this compound or compounds like it in BindingDB:
Activity Spreadsheet -- Enzyme Inhibition Constant Data from BindingDB
Found 2 hits for monomerid = 50128299
TargetEcdysone receptor(Choristoneura fumiferana)
Rheogene
Curated by ChEMBL
LigandPNGBDBM50128299(4-Methyl-benzo[1,3]dioxole-5-carboxylic acid [1-(3...)
Affinity DataEC50:  3.22E+3nM. Assay description: Dose affording 50% of maximum transactivation for ecdysone receptor from Choristoneura fumiferana (CfEcR) and a luciferase reporter gene in CHO cells
In DepthDetails ArticlePubMed
TargetEcdysone receptor(Bombyx mori)
Rheogene
Curated by ChEMBL
LigandPNGBDBM50128299(4-Methyl-benzo[1,3]dioxole-5-carboxylic acid [1-(3...)
Affinity DataEC50:  3.68E+3nM. Assay description: Dose affording 50% of maximum transactivation for ecdysone receptor from Bombyx mori (BmEcR) and a beta-galactosidase reporter gene in HEK-293 cell-l...
In DepthDetails ArticlePubMed