BDBM50128399 2-(4-Hydroxy-phenyl)-1,2,3,4-tetrahydro-quinolin-6-ol::CHEMBL293599
SMILES Oc1ccc(cc1)C1CCc2cc(O)ccc2N1
InChI Key InChIKey=SDOVQLQJVRIWQB-UHFFFAOYSA-N
Data  2 KI
  Tab Delimited (TSV)   2D SDfile   Computed 3D by Vconf -m prep SDfile
Find this compound or compounds like it in BindingDB:
Activity Spreadsheet -- Enzyme Inhibition Constant Data from BindingDB
Found 2 hits for monomerid = 50128399
TargetEstrogen receptor beta(Homo sapiens (Human))
Eli Lilly
Curated by ChEMBL
LigandPNGBDBM50128399(2-(4-Hydroxy-phenyl)-1,2,3,4-tetrahydro-quinolin-6...)
Affinity DataKi:  65nM. Assay description: Binding affinity for estrogen receptor beta
In DepthDetails ArticlePubMed
TargetEstrogen receptor(Homo sapiens (Human))
Eli Lilly
Curated by ChEMBL
LigandPNGBDBM50128399(2-(4-Hydroxy-phenyl)-1,2,3,4-tetrahydro-quinolin-6...)
Affinity DataKi:  170nM. Assay description: Binding affinity for estrogen receptor alpha
In DepthDetails ArticlePubMed