BDBM50128403 2-(4-Hydroxy-phenyl)-1-[4-(2-piperidin-1-yl-ethoxy)-phenyl]-1,2,3,4-tetrahydro-quinolin-6-ol::CHEMBL293297
SMILES Oc1ccc(cc1)C1CCc2cc(O)ccc2N1c1ccc(OCCN2CCCCC2)cc1
InChI Key InChIKey=DYVRNYHOABJFGS-UHFFFAOYSA-N
Data  2 KI  1 IC50
  Tab Delimited (TSV)   2D SDfile   Computed 3D by Vconf -m prep SDfile
Find this compound or compounds like it in BindingDB:
Activity Spreadsheet -- Enzyme Inhibition Constant Data from BindingDB
Found 3 hits for monomerid = 50128403
TargetEstrogen receptor(Homo sapiens (Human))
Eli Lilly
Curated by ChEMBL
LigandPNGBDBM50128403(2-(4-Hydroxy-phenyl)-1-[4-(2-piperidin-1-yl-ethoxy...)
Affinity DataKi:  2.5nM. Assay description: Binding affinity for estrogen receptor alpha
In DepthDetails ArticlePubMed
TargetEstrogen receptor beta(Homo sapiens (Human))
Eli Lilly
Curated by ChEMBL
LigandPNGBDBM50128403(2-(4-Hydroxy-phenyl)-1-[4-(2-piperidin-1-yl-ethoxy...)
Affinity DataKi:  8nM. Assay description: Binding affinity for estrogen receptor beta
In DepthDetails ArticlePubMed
TargetEstrogen receptor beta(Homo sapiens (Human))
Eli Lilly
Curated by ChEMBL
LigandPNGBDBM50128403(2-(4-Hydroxy-phenyl)-1-[4-(2-piperidin-1-yl-ethoxy...)
Affinity DataIC50:  590nM. Assay description: Inhibition of estradiol-stimulated MCF-7 breast adenocarcinoma cell proliferation
In DepthDetails ArticlePubMed