BDBM50128519 CHEMBL3629604
SMILES Cn1c2C(=O)c3ccccc3-c2c(=O)c2ccc(Cl)cc12
InChI Key InChIKey=KYLVMDJXJPCWJF-UHFFFAOYSA-N
Data  1 IC50
  Tab Delimited (TSV)   2D SDfile   Computed 3D by Vconf -m prep SDfile
Find this compound or compounds like it in BindingDB:
Activity Spreadsheet -- Enzyme Inhibition Constant Data from BindingDB
Found 1 hit for monomerid = 50128519
TargetHigh affinity nerve growth factor receptor(Homo sapiens (Human))
Institute For Basic Science (Ibs)
Curated by ChEMBL
LigandPNGBDBM50128519(CHEMBL3629604)
Affinity DataIC50:  8.85E+4nM. Assay description: Inhibition of TrkA (unknown origin) by radiometric analysis in presence of [gamma-33P]-ATP
In DepthDetails ArticlePubMed