BDBM50122307 CHEMBL293212::N-{4-[2-(3-Chloro-benzylamino)-ethyl]-phenyl}-thiophene-2-carboxamidine; hydrochloride
SMILES NC(=Nc1ccc(CCNCc2cccc(Cl)c2)cc1)c1cccs1
InChI Key InChIKey=ZZVGLDBDDYESAB-UHFFFAOYSA-N
Data  5 IC50
  Tab Delimited (TSV)   2D SDfile   Computed 3D by Vconf -m prep SDfile
Find this compound or compounds like it in BindingDB:
Activity Spreadsheet -- Enzyme Inhibition Constant Data from BindingDB
Found 5 hits for monomerid = 50122307
TargetNitric oxide synthase, brain(Homo sapiens (Human))
Schering
Curated by ChEMBL
LigandPNGBDBM50122307(CHEMBL293212 | N-{4-[2-(3-Chloro-benzylamino)-ethy...)
Affinity DataIC50:  35nM. Assay description: Inhibitory concentration against recombinant human (neuronal nitric oxide synthase) n-NOS
In DepthDetails ArticlePubMed
TargetNitric oxide synthase, inducible(Homo sapiens (Human))
Schering
Curated by ChEMBL
LigandPNGBDBM50122307(CHEMBL293212 | N-{4-[2-(3-Chloro-benzylamino)-ethy...)
Affinity DataIC50:  5.00E+3nM. Assay description: Inhibitory concentration against human Inducible nitric oxide synthase
In DepthDetails ArticlePubMed
TargetNitric oxide synthase, inducible(Mus musculus (mouse))
Northwestern University
Curated by ChEMBL
LigandPNGBDBM50122307(CHEMBL293212 | N-{4-[2-(3-Chloro-benzylamino)-ethy...)
Affinity DataIC50:  5.00E+3nM. Assay description: Inhibition of mouse recombinant iNOS expressed in Escherichia coli using L-arginine as substrate assessed as NO production by hemoglobin capture assa...
In DepthDetails ArticlePubMed
TargetNitric oxide synthase, brain(Rattus norvegicus (rat))
Northwestern University
Curated by ChEMBL
LigandPNGBDBM50122307(CHEMBL293212 | N-{4-[2-(3-Chloro-benzylamino)-ethy...)
Affinity DataIC50:  35nM. Assay description: Inhibition of rat recombinant nNOS expressed in Escherichia coli using L-arginine as substrate assessed as NO production by hemoglobin capture assay
In DepthDetails ArticlePubMed
TargetNitric oxide synthase, endothelial(Homo sapiens (Human))
Schering
Curated by ChEMBL
LigandPNGBDBM50122307(CHEMBL293212 | N-{4-[2-(3-Chloro-benzylamino)-ethy...)
Affinity DataIC50:  3.50E+3nM. Assay description: Inhibitory concentration against recombinant human Endothelial nitric oxide synthase
In DepthDetails ArticlePubMed