BDBM50128925 9-Ethyl-3-(1H-imidazo[4,5-c]pyridin-2-yl)-9H-carbazole::CHEMBL417225
SMILES CCn1c2ccccc2c2cc(ccc12)-c1nc2ccncc2[nH]1
InChI Key InChIKey=BSEFEFWNWWAMGX-UHFFFAOYSA-N
Data  1 KI
  Tab Delimited (TSV)   2D SDfile   Computed 3D by Vconf -m prep SDfile
Find this compound or compounds like it in BindingDB:
Activity Spreadsheet -- Enzyme Inhibition Constant Data from BindingDB
Found 1 hit for monomerid = 50128925
TargetNeuropeptide Y receptor type 5(Homo sapiens (Human))
Pfizer
Curated by ChEMBL
LigandPNGBDBM50128925(9-Ethyl-3-(1H-imidazo[4,5-c]pyridin-2-yl)-9H-carba...)
Affinity DataKi:  15nM. Assay description: Binding affinity towards human neuropeptide Y receptor type 5 using 125[I]-PYY as radioligand
In DepthDetails ArticlePubMed