BDBM50128977 2-Hydroxy-1H-pyrrolo[3,2-b]pyridine-3-carbonitrile::CHEMBL292552
SMILES O=c1[nH]c2ccc[nH]c2c1C#N
InChI Key InChIKey=NBCMHCSMMPJOBH-UHFFFAOYSA-N
Data  1 EC50
  Tab Delimited (TSV)   2D SDfile   Computed 3D by Vconf -m prep SDfile
Find this compound or compounds like it in BindingDB:
Activity Spreadsheet -- Enzyme Inhibition Constant Data from BindingDB
Found 1 hit for monomerid = 50128977
TargetCalcium-activated potassium channel subunit alpha-1(Homo sapiens (Human))
Abbott Laboratories
Curated by ChEMBL
LigandPNGBDBM50128977(2-Hydroxy-1H-pyrrolo[3,2-b]pyridine-3-carbonitrile...)
Affinity DataEC50:  1.34E+4nM. Assay description: [86Rb+] efflux induced by BKca alpha subunits expressed in HEK293 cells at 10 microM
In DepthDetails ArticlePubMed