BDBM50128978 2-Imidazol-1-yl-1H-pyrrolo[3,2-b]pyridine-3-carbonitrile::CHEMBL294334
SMILES N#Cc1c([nH]c2cccnc12)-n1ccnc1
InChI Key InChIKey=AIHCKDOZTMTNQB-UHFFFAOYSA-N
Data  1 EC50
  Tab Delimited (TSV)   2D SDfile   Computed 3D by Vconf -m prep SDfile
Find this compound or compounds like it in BindingDB:
Activity Spreadsheet -- Enzyme Inhibition Constant Data from BindingDB
Found 1 hit for monomerid = 50128978
TargetCalcium-activated potassium channel subunit alpha-1(Homo sapiens (Human))
Abbott Laboratories
Curated by ChEMBL
LigandPNGBDBM50128978(2-Imidazol-1-yl-1H-pyrrolo[3,2-b]pyridine-3-carbon...)
Affinity DataEC50:  5.86E+3nM. Assay description: [86Rb+] efflux induced by BKca alpha subunits expressed in HEK293 cells at 10 microM
In DepthDetails ArticlePubMed