BDBM50129072 CHEMBL64245::[1-((3S,4R)-2-Oxo-4-phenoxy-azetidin-3-ylcarbamoyl)-cyclohexyl]-carbamic acid benzyl ester
SMILES O=C(NC1(CCCCC1)C(=O)N[C@H]1[C@H](NC1=O)Oc1ccccc1)OCc1ccccc1
InChI Key InChIKey=AOOLAAKZAJVJMI-TZIWHRDSSA-N
Data  4 KI
  Tab Delimited (TSV)   2D SDfile   Computed 3D by Vconf -m prep SDfile
Find this compound or compounds like it in BindingDB:
Activity Spreadsheet -- Enzyme Inhibition Constant Data from BindingDB
Found 4 hits for monomerid = 50129072
TargetCathepsin K(Homo sapiens (Human))
Ligand Pharmaceuticals
Curated by ChEMBL
LigandPNGBDBM50129072(CHEMBL64245 | [1-((3S,4R)-2-Oxo-4-phenoxy-azetidin...)
Affinity DataKi:  3.60E+3nM. Assay description: Inhibitory activity of the compound was measured against Cathepsin K
In DepthDetails ArticlePubMed
TargetProcathepsin L(Homo sapiens (Human))
Ligand Pharmaceuticals
Curated by ChEMBL
LigandPNGBDBM50129072(CHEMBL64245 | [1-((3S,4R)-2-Oxo-4-phenoxy-azetidin...)
Affinity DataKi:  1.60E+4nM. Assay description: Inhibitory activity of the compound was measured against Cathepsin L
In DepthDetails ArticlePubMed
TargetCathepsin S(Homo sapiens (Human))
Ligand Pharmaceuticals
Curated by ChEMBL
LigandPNGBDBM50129072(CHEMBL64245 | [1-((3S,4R)-2-Oxo-4-phenoxy-azetidin...)
Affinity DataKi:  5.30E+4nM. Assay description: Inhibitory activity of the compound was measured against Cathepsin S
In DepthDetails ArticlePubMed
TargetCathepsin B(Homo sapiens (Human))
Ligand Pharmaceuticals
Curated by ChEMBL
LigandPNGBDBM50129072(CHEMBL64245 | [1-((3S,4R)-2-Oxo-4-phenoxy-azetidin...)
Affinity DataKi: >1.50E+5nM. Assay description: Inhibitory activity of the compound was measured against Cathepsin B
In DepthDetails ArticlePubMed