BDBM50129183 2-(3-Benzyl-ureido)-3-(1H-indol-3-yl)-N-(3-methyl-benzyl)-propionamide::CHEMBL61681
SMILES Cc1cccc(CNC(=O)[C@H](Cc2c[nH]c3ccccc23)NC(=O)NCc2ccccc2)c1
InChI Key InChIKey=IBFSTESMBHZKAL-VWLOTQADSA-N
Data  4 EC50
  Tab Delimited (TSV)   2D SDfile   Computed 3D by Vconf -m prep SDfile
Find this compound or compounds like it in BindingDB:
Activity Spreadsheet -- Enzyme Inhibition Constant Data from BindingDB
Found 4 hits for monomerid = 50129183
TargetMelanocortin receptor 5(Mus musculus (Mouse))
University Of Florida
Curated by ChEMBL
LigandPNGBDBM50129183(2-(3-Benzyl-ureido)-3-(1H-indol-3-yl)-N-(3-methyl-...)
Affinity DataEC50: >1.00E+5nM. Assay description: Agonist activity on mouse melanocortin 5 receptor (mMC5R) stably expressed in HEL cells
In DepthDetails ArticlePubMed
TargetMelanocortin receptor 4(Mus musculus)
University Of Florida
Curated by ChEMBL
LigandPNGBDBM50129183(2-(3-Benzyl-ureido)-3-(1H-indol-3-yl)-N-(3-methyl-...)
Affinity DataEC50: >1.00E+5nM. Assay description: Agonist activity on mouse melanocortin 4 receptor (mMC4R) stably expressed in HEL cells
In DepthDetails ArticlePubMed
TargetMelanocortin receptor 3(Mus musculus)
University Of Florida
Curated by ChEMBL
LigandPNGBDBM50129183(2-(3-Benzyl-ureido)-3-(1H-indol-3-yl)-N-(3-methyl-...)
Affinity DataEC50: >1.00E+5nM. Assay description: Agonist activity on mouse Melanocortin 3 receptor (mMC3R) stably expressed in HEK cells
In DepthDetails ArticlePubMed
TargetMelanocyte-stimulating hormone receptor(Mus musculus)
University Of Florida
Curated by ChEMBL
LigandPNGBDBM50129183(2-(3-Benzyl-ureido)-3-(1H-indol-3-yl)-N-(3-methyl-...)
Affinity DataEC50:  2.80E+4nM. Assay description: Agonist activity on mouse melanocortin 1 receptor (mMC1R) stably expressed in HEK cells
In DepthDetails ArticlePubMed