BDBM50129186 CHEMBL305391::N-(5-Amino-pentyl)-2-((S)-3-benzyl-ureido)-3-(1H-indol-3-yl)-propionamide
SMILES NCCCCCNC(=O)[C@H](Cc1c[nH]c2ccccc12)NC(=O)NCc1ccccc1
InChI Key InChIKey=CWJHVSDNADCVQK-QFIPXVFZSA-N
Data  4 EC50
  Tab Delimited (TSV)   2D SDfile   Computed 3D by Vconf -m prep SDfile
Find this compound or compounds like it in BindingDB:
Activity Spreadsheet -- Enzyme Inhibition Constant Data from BindingDB
Found 4 hits for monomerid = 50129186
TargetMelanocyte-stimulating hormone receptor(Mus musculus)
University Of Florida
Curated by ChEMBL
LigandPNGBDBM50129186(CHEMBL305391 | N-(5-Amino-pentyl)-2-((S)-3-benzyl-...)
Affinity DataEC50:  1.48E+4nM. Assay description: Agonist activity on mouse melanocortin 1 receptor (mMC1R) stably expressed in HEK cells
In DepthDetails ArticlePubMed
TargetMelanocortin receptor 5(Mus musculus (Mouse))
University Of Florida
Curated by ChEMBL
LigandPNGBDBM50129186(CHEMBL305391 | N-(5-Amino-pentyl)-2-((S)-3-benzyl-...)
Affinity DataEC50:  2.00E+4nM. Assay description: Agonist activity on mouse melanocortin 5 receptor (mMC5R) stably expressed in HEL cells
In DepthDetails ArticlePubMed
TargetMelanocortin receptor 4(Mus musculus)
University Of Florida
Curated by ChEMBL
LigandPNGBDBM50129186(CHEMBL305391 | N-(5-Amino-pentyl)-2-((S)-3-benzyl-...)
Affinity DataEC50: >1.00E+5nM. Assay description: Agonist activity on mouse melanocortin 4 receptor (mMC4R) stably expressed in HEL cells
In DepthDetails ArticlePubMed
TargetMelanocortin receptor 3(Mus musculus)
University Of Florida
Curated by ChEMBL
LigandPNGBDBM50129186(CHEMBL305391 | N-(5-Amino-pentyl)-2-((S)-3-benzyl-...)
Affinity DataEC50: >1.00E+5nM. Assay description: Agonist activity on mouse Melanocortin 3 receptor (mMC3R) stably expressed in HEK cells
In DepthDetails ArticlePubMed