BDBM50129643 CHEMBL89523::[2-(Thiazol-2-ylcarbamoyl)-pyridin-3-yl]-carbamic acid isobutyl ester
SMILES CC(C)COC(=O)Nc1cccnc1C(=O)Nc1nccs1
InChI Key InChIKey=ZQXDSFJLWUTJIJ-UHFFFAOYSA-N
Data  2 IC50
  Tab Delimited (TSV)   2D SDfile   Computed 3D by Vconf -m prep SDfile
Find this compound or compounds like it in BindingDB:
Activity Spreadsheet -- Enzyme Inhibition Constant Data from BindingDB
Found 2 hits for monomerid = 50129643
TargetMethionine aminopeptidase(Escherichia coli (strain K12))
Chinese Academy Of Sciences
Curated by ChEMBL
LigandPNGBDBM50129643(CHEMBL89523 | [2-(Thiazol-2-ylcarbamoyl)-pyridin-3...)
Affinity DataIC50:  1.92E+3nM. Assay description: Inhibitory activity against Methionine aminopeptidase 1 from Escherichia coli
In DepthDetails ArticlePubMed
TargetMethionine aminopeptidase 1(Saccharomyces cerevisiae)
Chinese Academy Of Sciences
Curated by ChEMBL
LigandPNGBDBM50129643(CHEMBL89523 | [2-(Thiazol-2-ylcarbamoyl)-pyridin-3...)
Affinity DataIC50:  5.37E+4nM. Assay description: Inhibitory activity against type I methionine aminopeptidase from Saccharomyces cerevisiae
In DepthDetails ArticlePubMed