BDBM50129685 2-Amino-4-methyl-pentanal::CHEMBL88476
SMILES CC(C)CC(N)C=O
InChI Key InChIKey=ZOFRRNUENOHELM-UHFFFAOYSA-N
Data  1 KI
  Tab Delimited (TSV)   2D SDfile   Computed 3D by Vconf -m prep SDfile
Find this compound or compounds like it in BindingDB:
Activity Spreadsheet -- Enzyme Inhibition Constant Data from BindingDB
Found 1 hit for monomerid = 50129685
TargetCytosol aminopeptidase(Homo sapiens (Human))
Wroclaw University Of Technology
Curated by ChEMBL
LigandPNGBDBM50129685(2-Amino-4-methyl-pentanal | CHEMBL88476)
Affinity DataKi:  60nM. Assay description: Binding affinity for cytosolic leucine aminopeptidase (LAP) from porcine kidney
In DepthDetails ArticlePubMed