BDBM50129958 3-[2-(4-Carbamimidoyl-phenoxy)-4-methyl-quinolin-7-yl]-but-2-enoic acid ethyl ester::CHEMBL424049
SMILES CCOC(=O)\C=C(/C)c1ccc2c(C)cc(Oc3ccc(cc3)C(N)=N)nc2c1
InChI Key InChIKey=KNKTVUFYEBQQAX-WYMLVPIESA-N
Data  3 IC50
  Tab Delimited (TSV)   2D SDfile   Computed 3D by Vconf -m prep SDfile
Find this compound or compounds like it in BindingDB:
Activity Spreadsheet -- Enzyme Inhibition Constant Data from BindingDB
Found 3 hits for monomerid = 50129958
TargetSerine protease 1(Homo sapiens (Human))
Boehringer Ingelheim Pharma
Curated by ChEMBL
LigandPNGBDBM50129958(3-[2-(4-Carbamimidoyl-phenoxy)-4-methyl-quinolin-7...)
Affinity DataIC50:  6.70E+3nM. Assay description: Inhibitory activity of the compound against trypsin
In DepthDetails ArticlePubMed
TargetPlasminogen(Homo sapiens (Human))
Boehringer Ingelheim Pharma
Curated by ChEMBL
LigandPNGBDBM50129958(3-[2-(4-Carbamimidoyl-phenoxy)-4-methyl-quinolin-7...)
Affinity DataIC50:  6.40E+3nM. Assay description: Inhibitory activity of the compound against plasmin in human plasma
In DepthDetails ArticlePubMed
TargetProthrombin(Homo sapiens (Human))
Boehringer Ingelheim Pharma
Curated by ChEMBL
LigandPNGBDBM50129958(3-[2-(4-Carbamimidoyl-phenoxy)-4-methyl-quinolin-7...)
Affinity DataIC50:  16nM. Assay description: In vitro inhibitory activity against thrombin in human plasma
In DepthDetails ArticlePubMed