BDBM50130040 CHEMBL3629657
SMILES [O-][N+](=O)c1cccc(c1)S(=O)(=O)NC(=O)[C@H](Cc1ccccc1)N1C(=O)N[C@@H](Cc2ccc(cc2)-c2ccc(Cl)cc2)C1=O
InChI Key InChIKey=LPRJNULURVOLPV-NSOVKSMOSA-N
Data  3 KI
  Tab Delimited (TSV)   2D SDfile   Computed 3D by Vconf -m prep SDfile
Find this compound or compounds like it in BindingDB:
Activity Spreadsheet -- Enzyme Inhibition Constant Data from BindingDB
Found 3 hits for monomerid = 50130040
TargetApoptosis regulator Bcl-2(Homo sapiens (Human))
Shandong University
Curated by ChEMBL
LigandPNGBDBM50130040(CHEMBL3629657)
Affinity DataKi:  1.50E+4nM. Assay description: Competitive binding affinity to Bcl-2 (unknown origin) preincubated for 30 mins followed by 5-FAM-Bid-BH3 peptide addition measured after 20 mins by ...
In DepthDetails ArticlePubMed
TargetBcl-2-like protein 1(Homo sapiens (Human))
Shandong University
Curated by ChEMBL
LigandPNGBDBM50130040(CHEMBL3629657)
Affinity DataKi: >5.00E+4nM. Assay description: Competitive binding affinity to Bcl-XL (unknown origin) preincubated for 30 mins followed by 5-FAM-Bid-BH3 peptide addition measured after 20 mins by...
In DepthDetails ArticlePubMed
TargetInduced myeloid leukemia cell differentiation protein Mcl-1(Homo sapiens (Human))
Shandong University
Curated by ChEMBL
LigandPNGBDBM50130040(CHEMBL3629657)
Affinity DataKi: >5.00E+4nM. Assay description: Competitive binding affinity to Mcl-1 (unknown origin) preincubated for 30 mins followed by 5-FAM-Bid-BH3 peptide addition measured after 20 mins by ...
In DepthDetails ArticlePubMed