BDBM50130113 (R)-2-[Benzo[1,3]dioxol-5-ylmethyl-(4-methoxy-benzenesulfonyl)-amino]-pentanedioic acid 5-diethylamide 1-hydroxyamide::CHEMBL312738
SMILES CCN(CC)C(=O)CC[C@@H](N(Cc1ccc2OCOc2c1)S(=O)(=O)c1ccc(OC)cc1)C(=O)NO
InChI Key InChIKey=LQVBVMXEHQRKTM-HXUWFJFHSA-N
Data  1 KI
  Tab Delimited (TSV)   2D SDfile   Computed 3D by Vconf -m prep SDfile
Find this compound or compounds like it in BindingDB:
Activity Spreadsheet -- Enzyme Inhibition Constant Data from BindingDB
Found 1 hit for monomerid = 50130113
TargetBone morphogenetic protein 1(Homo sapiens (Human))
Combichem
Curated by ChEMBL
LigandPNGBDBM50130113((R)-2-[Benzo[1,3]dioxol-5-ylmethyl-(4-methoxy-benz...)
Affinity DataKi:  1.30E+3nM. Assay description: Ability to inhibit procollagen C-terminal proteinase (PCP) tested in vitro
In DepthDetails ArticlePubMed