BDBM50130256 CHEMBL3632875
SMILES [H][C@]12C3CCCN3[C@@H](c3ccc(cc3)C(N)=N)[C@@]1([H])C(=O)N(Cc1ccc(Cl)cc1)[C@@H]2C(C)C
InChI Key InChIKey=LVAIBFBNGXNDPW-ILBZXIDRSA-N
Data  1 KI
  Tab Delimited (TSV)   2D SDfile   Computed 3D by Vconf -m prep SDfile
Find this compound or compounds like it in BindingDB:
Activity Spreadsheet -- Enzyme Inhibition Constant Data from BindingDB
Found 1 hit for monomerid = 50130256
TargetProthrombin(Homo sapiens (Human))
Bristol-Myers Squibb Research And Development
Curated by ChEMBL
LigandPNGBDBM50130256(CHEMBL3632875)
Affinity DataKi:  8nM. Assay description: Inhibition of human Thrombin using S-2238 as substrate assessed as release of p-nitroaniline preincubated for 240 secs followed by substrate addition...
In DepthDetails ArticlePubMed